Target
Acetylcholinesterase
Ligand
BDBM50245887
Substrate
Meas. Tech.
ChEMBL_531267 (CHEMBL986117)
Ki
510±n/a nM
Citation
 Wen, HLin, CQue, LGe, HMa, LCao, RWan, YPeng, WWang, ZSong, H Synthesis and biological evaluation of helicid analogues as novel acetylcholinesterase inhibitors. Eur J Med Chem 43:166-73 (2008)  
Target
Name:
Acetylcholinesterase
Synonyms:
ACES_ELEEL Acetylcholinesterase (EeAChE) | ache
Type:
Enzyme
Mol. Mass.:
71812.79
Organism:
Electrophorus electricus (Electric eel)
Description:
Residue:
633
  
Inhibitor
Name:
BDBM50245887
Synonyms:
4-((2S,3R,4R,5R)-3,4,5-trihydroxy-tetrahydro-2H-pyran-2-yloxy)benzaldehyde CHEMBL499285
Type:
Small organic molecule
Emp. Form.:
C12H14O6
Mol. Mass.:
254.236
SMILES:
O[C@@H]1CO[C@@H](Oc2ccc(C=O)cc2)[C@H](O)[C@@H]1O
: