Target
Cannabinoid receptor 1
Ligand
BDBM50260626
Substrate
Meas. Tech.
ChEMBL_552268 (CHEMBL995598)
Ki
2720±n/a nM
Citation
 Omura, HKawai, MShima, AIwata, YIto, FMasuda, TOhta, AMakita, NOmoto, KSugimoto, HKikuchi, AIwata, HAndo, K The SAR studies of novel CB2 selective agonists, benzimidazolone derivatives. Bioorg Med Chem Lett 18:3310-4 (2008)  
Target
Name:
Cannabinoid receptor 1
Synonyms:
CANN6 CB-R CNR CNR1_HUMAN Cannabinoid receptor Cannabinoid receptor 1 (brain)
Type:
G Protein-Coupled Receptor (GPCR)
Mol. Mass.:
52868.96
Organism:
Homo sapiens (Human)
Description:
P21554
Residue:
472
  
Inhibitor
Name:
BDBM50260626
Synonyms:
(S)-N'-(3,3-dimethyl-1-(methylamino)-1-oxobutan-2-yl)-3-(2-morpholinoethyl)-2-oxo-2,3-dihydrobenzo[d]imidazole-1-carbohydrazide | CHEMBL494207
Type:
Small organic molecule
Emp. Form.:
C21H31N5O4
Mol. Mass.:
417.5019
SMILES:
CNC(=O)[C@@H](NC(=O)n1c2ccccc2n(CCN2CCOCC2)c1=O)C(C)(C)C
: