Target
Acetylcholinesterase
Ligand
BDBM10439
Substrate
Meas. Tech.
ChEMBL_552463 (CHEMBL1002723)
Ki
0.800000±n/a nM
Citation
 Butini, SCampiani, GBorriello, MGemma, SPanico, APersico, MCatalanotti, BRos, SBrindisi, MAgnusdei, MFiorini, INacci, VNovellino, EBelinskaya, TSaxena, AFattorusso, C Exploiting protein fluctuations at the active-site gorge of human cholinesterases: further optimization of the design strategy to develop extremely potent inhibitors. J Med Chem 51:3154-70 (2008)  
Target
Name:
Acetylcholinesterase
Synonyms:
3.1.1.7 Acetylcholinesterase (AChE) ache
Type:
Mol. Mass.:
65900.74
Organism:
Tetronarce californica (Pacific electric ray) (Torpedo californica)
Description:
P04058
Residue:
586
  
Inhibitor
Name:
BDBM10439
Synonyms:
(5S)-5-[(10-{[(5S)-2-oxo-1,2,5,6,7,8-hexahydroquinolin-5-yl]amino}decyl)amino]-1,2,5,6,7,8-hexahydroquinolin-2-one | (S,S)-(-)-bis(10)-hupyridone
Type:
Small organic molecule
Emp. Form.:
C28H42N4O2
Mol. Mass.:
466.6587
SMILES:
O=c1ccc2[C@H](CCCc2[nH]1)NCCCCCCCCCCN[C@H]1CCCc2[nH]c(=O)ccc12
: