Target
Acetylcholinesterase
Ligand
BDBM8977
Substrate
Meas. Tech.
ChEMBL_552457 (CHEMBL1002717)
Ki
5.15±n/a nM
Citation
 Butini, SCampiani, GBorriello, MGemma, SPanico, APersico, MCatalanotti, BRos, SBrindisi, MAgnusdei, MFiorini, INacci, VNovellino, EBelinskaya, TSaxena, AFattorusso, C Exploiting protein fluctuations at the active-site gorge of human cholinesterases: further optimization of the design strategy to develop extremely potent inhibitors. J Med Chem 51:3154-70 (2008)  
Target
Name:
Acetylcholinesterase
Synonyms:
ACES_HUMAN Acetylcholinesterase (AChE) | Acetylcholinesterase (human AChE)
Type:
Enzyme
Mol. Mass.:
67792.70
Organism:
Homo sapiens (Human)
Description:
P22303
Residue:
614
  
Inhibitor
Name:
BDBM8977
Synonyms:
CHEMBL175949 Tacrine Dimer 4m
Type:
Small organic molecule
Emp. Form.:
C35H42N4OS
Mol. Mass.:
566.799
SMILES:
CC(=O)N(CCCCSc1c2CCCCc2nc2ccccc12)CCCNc1c2CCCCc2nc2ccccc12
: