Target
Cholinesterase
Ligand
BDBM50271325
Substrate
Meas. Tech.
ChEMBL_552458 (CHEMBL1002718)
Ki
0.725±n/a nM
Citation
 Butini, SCampiani, GBorriello, MGemma, SPanico, APersico, MCatalanotti, BRos, SBrindisi, MAgnusdei, MFiorini, INacci, VNovellino, EBelinskaya, TSaxena, AFattorusso, C Exploiting protein fluctuations at the active-site gorge of human cholinesterases: further optimization of the design strategy to develop extremely potent inhibitors. J Med Chem 51:3154-70 (2008)  
Target
Name:
Cholinesterase
Synonyms:
Acylcholine acylhydrolase Butyrylcholine esterase (BChE) Butyrylcholinesterase (BuChE) CHLE_HUMAN Cholinesterases Pseudocholinesterase
Type:
Homotetramer
Mol. Mass.:
68422.27
Organism:
Homo sapiens (Human)
Description:
P06276
Residue:
602
  
Inhibitor
Name:
BDBM50271325
Synonyms:
CHEMBL451277 | N-{4-[(1,2,3,4-Tetrahydroacridin-9-yl)amino]butyl}-N{3-[(1,2,3,4-tetrahydroacridin-9-yl)amino]propyl}acetamide
Type:
Small organic molecule
Emp. Form.:
C35H43N5O
Mol. Mass.:
549.7488
SMILES:
CC(=O)N(CCCCNc1c2CCCCc2nc2ccccc12)CCCNc1c2CCCCc2nc2ccccc12
: