Target
Cholinesterase
Ligand
BDBM50271324
Substrate
Meas. Tech.
ChEMBL_552458 (CHEMBL1002718)
Ki
0.779±n/a nM
Citation
 Butini, SCampiani, GBorriello, MGemma, SPanico, APersico, MCatalanotti, BRos, SBrindisi, MAgnusdei, MFiorini, INacci, VNovellino, EBelinskaya, TSaxena, AFattorusso, C Exploiting protein fluctuations at the active-site gorge of human cholinesterases: further optimization of the design strategy to develop extremely potent inhibitors. J Med Chem 51:3154-70 (2008)  
Target
Name:
Cholinesterase
Synonyms:
Acylcholine acylhydrolase Butyrylcholine esterase (BChE) Butyrylcholinesterase (BuChE) CHLE_HUMAN Cholinesterases Pseudocholinesterase
Type:
Homotetramer
Mol. Mass.:
68422.27
Organism:
Homo sapiens (Human)
Description:
P06276
Residue:
602
  
Inhibitor
Name:
BDBM50271324
Synonyms:
CHEMBL482512 | N-(1,2,3,4-Tetrahydroacridin-9-yl)-N-(3-(1,2,3,4-tetrahydroacridin-9-ylsulfanyl)propyl)-1,4-butanediamine
Type:
Small organic molecule
Emp. Form.:
C33H40N4S
Mol. Mass.:
524.763
SMILES:
C(CCNc1c2CCCCc2nc2ccccc12)CNCCCSc1c2CCCCc2nc2ccccc12
: