Target
Acetylcholinesterase
Ligand
BDBM50055159
Substrate
Meas. Tech.
ChEMBL_552464 (CHEMBL1002724)
Ki
23000±n/a nM
Citation
 Butini, SCampiani, GBorriello, MGemma, SPanico, APersico, MCatalanotti, BRos, SBrindisi, MAgnusdei, MFiorini, INacci, VNovellino, EBelinskaya, TSaxena, AFattorusso, C Exploiting protein fluctuations at the active-site gorge of human cholinesterases: further optimization of the design strategy to develop extremely potent inhibitors. J Med Chem 51:3154-70 (2008)  
Target
Name:
Acetylcholinesterase
Synonyms:
ACES_MOUSE Acetylcholinesterase (mouse AChE) Ache
Type:
Enzyme
Mol. Mass.:
68165.65
Organism:
Mus musculus (mouse)
Description:
Residue:
614
  
Inhibitor
Name:
BDBM50055159
Synonyms:
CHEMBL136916 Trimethyl-(4-oxo-pentyl)-ammonium; iodide
Type:
Small organic molecule
Emp. Form.:
C8H18NO
Mol. Mass.:
144.2341
SMILES:
CC(=O)CCC[N+](C)(C)C
: