Target
Acetylcholinesterase
Ligand
BDBM10406
Substrate
Meas. Tech.
ChEMBL_552463 (CHEMBL1002723)
IC50
4±n/a nM
Citation
 Butini, SCampiani, GBorriello, MGemma, SPanico, APersico, MCatalanotti, BRos, SBrindisi, MAgnusdei, MFiorini, INacci, VNovellino, EBelinskaya, TSaxena, AFattorusso, C Exploiting protein fluctuations at the active-site gorge of human cholinesterases: further optimization of the design strategy to develop extremely potent inhibitors. J Med Chem 51:3154-70 (2008)  
Target
Name:
Acetylcholinesterase
Synonyms:
3.1.1.7 Acetylcholinesterase (AChE) ache
Type:
Mol. Mass.:
65900.74
Organism:
Tetronarce californica (Pacific electric ray) (Torpedo californica)
Description:
P04058
Residue:
586
  
Inhibitor
Name:
BDBM10406
Synonyms:
(1S,12S,14R)-4-[8-(1,3-dioxo-2,3-dihydro-1H-isoindol-2-yl)octyl]-14-hydroxy-9-methoxy-11-oxa-4-azatetracyclo[8.6.1.0^{1,12}.0^{6,17}]heptadeca-4,6,8,10(17),15-pentaen-4-ium galanthamine deriv. 4d
Type:
Small organic molecule
Emp. Form.:
C32H37N2O5
Mol. Mass.:
529.646
SMILES:
COc1ccc2C=[N+](CCCCCCCCN3C(=O)c4ccccc4C3=O)CC[C@@]34C=C[C@H](O)C[C@@H]3Oc1c24
: