Target
Solute carrier family 22 member 20
Ligand
BDBM36181
Substrate
Meas. Tech.
ChEMBL_508178 (CHEMBL1008236)
Ki
13800±n/a nM
Citation
 Kaler, GTruong, DMKhandelwal, ANagle, MEraly, SASwaan, PWNigam, SK Structural variation governs substrate specificity for organic anion transporter (OAT) homologs. Potential remote sensing by OAT family members. J Biol Chem 282:23841-53 (2007)  
Target
Name:
Solute carrier family 22 member 20
Synonyms:
Gm963 S22AK_MOUSE | Slc22a20
Type:
PROTEIN
Mol. Mass.:
60953.19
Organism:
Mus musculus
Description:
ChEMBL_508178
Residue:
556
  
Inhibitor
Name:
BDBM36181
Synonyms:
SODIUM BENZOATE benzoic acid | benzoic acid-d5
Type:
Guest
Emp. Form.:
C7H5O2
Mol. Mass.:
121.1139
SMILES:
[O-]C(=O)c1ccccc1
: