Target
Solute carrier family 22 member 20
Ligand
BDBM50270008
Substrate
Meas. Tech.
ChEMBL_508178 (CHEMBL1008236)
Ki
533000±n/a nM
Citation
 Kaler, GTruong, DMKhandelwal, ANagle, MEraly, SASwaan, PWNigam, SK Structural variation governs substrate specificity for organic anion transporter (OAT) homologs. Potential remote sensing by OAT family members. J Biol Chem 282:23841-53 (2007)  
Target
Name:
Solute carrier family 22 member 20
Synonyms:
Gm963 S22AK_MOUSE | Slc22a20
Type:
PROTEIN
Mol. Mass.:
60953.19
Organism:
Mus musculus
Description:
ChEMBL_508178
Residue:
556
  
Inhibitor
Name:
BDBM50270008
Synonyms:
(2S,5R,6R)-6-{[(2R)-2-carboxylato-2-thiophen-3-ylacetyl]amino}-3,3-dimethyl-7-oxo-4-thia-1-azabicyclo[3.2.0]heptane-2-carboxylate Ticarcillin Disodium | ticarcillin(2-)
Type:
Small organic molecule
Emp. Form.:
C15H14N2O6S2
Mol. Mass.:
382.413
SMILES:
CC1(C)S[C@@H]2[C@H](NC(=O)[C@H](C([O-])=O)c3ccsc3)C(=O)N2[C@H]1C([O-])=O
: