Target
NAD-dependent protein deacetylase HST2
Ligand
BDBM50242435
Substrate
Meas. Tech.
ChEMBL_533704 (CHEMBL973326)
Kd
3300±n/a nM
Citation
 Smith, BCDenu, JM Acetyl-lysine analog peptides as mechanistic probes of protein deacetylases. J Biol Chem 282:37256-65 (2007)  
Target
Name:
NAD-dependent protein deacetylase HST2
Synonyms:
HST2 NAD-dependent deacetylase HST2
Type:
PROTEIN
Mol. Mass.:
39972.79
Organism:
Saccharomyces cerevisiae
Description:
ChEMBL_533704
Residue:
357
  
Inhibitor
Name:
BDBM50242435
Synonyms:
(2S)-2-[(2S)-6-amino-2-[(2S)-5-carbamimidamido-2-{[(2S)-1-[(2S)-2-[(2S)-6-(carbamoylamino)-2-(2-{2-[(2S,3R)-2-[(2S)-2-[(2S)-2,6-diaminohexanamido]-3-hydroxypropanamido]-3-hydroxybutanamido]acetamido}acetamido)hexanamido]propanoyl]pyrrolidin-2-yl]formamido}pentanamido]hexanamido]-4-carbamoylbutanoic acid | CHEMBL500219
Type:
Small organic molecule
Emp. Form.:
C49H89N19O16
Mol. Mass.:
1200.3487
SMILES:
[#6]-[#6@@H](-[#8])-[#6@H](-[#7]-[#6](=O)-[#6@H](-[#6]-[#8])-[#7]-[#6](=O)-[#6@@H](-[#7])-[#6]-[#6]-[#6]-[#6]-[#7])-[#6](=O)-[#7]-[#6]-[#6](=O)-[#7]-[#6]-[#6](=O)-[#7]-[#6@@H](-[#6]-[#6]-[#6]-[#6]-[#7]-[#6](-[#7])=O)-[#6](=O)-[#7]-[#6@@H](-[#6])-[#6](=O)-[#7]-1-[#6]-[#6]-[#6]-[#6@H]-1-[#6](=O)-[#7]-[#6@@H](-[#6]-[#6]-[#6]\[#7]=[#6](/[#7])-[#7])-[#6](=O)-[#7]-[#6@@H](-[#6]-[#6]-[#6]-[#6]-[#7])-[#6](=O)-[#7]-[#6@@H](-[#6]-[#6]-[#6](-[#7])=O)-[#6](-[#8])=O
: