Target
Fatty acid-binding protein, liver
Ligand
BDBM50000766
Substrate
Meas. Tech.
ChEMBL_555398 (CHEMBL964795)
Ki
115000±n/a nM
Citation
 Chuang, SVelkov, THorne, JPorter, CJScanlon, MJ Characterization of the drug binding specificity of rat liver fatty acid binding protein. J Med Chem 51:3755-64 (2008)  
Target
Name:
Fatty acid-binding protein, liver
Synonyms:
FABPL_RAT Fatty acid-binding protein, liver | Liver fatty acid binding protein (rat L-FABP)
Type:
Protein
Mol. Mass.:
14274.39
Organism:
Rattus norvegicus (Rat)
Description:
rat L-FABP
Residue:
127
  
Inhibitor
Name:
BDBM50000766
Synonyms:
CHEMBL12 US9271961, Diazepam
Type:
Small organic molecule
Emp. Form.:
C16H13ClN2O
Mol. Mass.:
284.74
SMILES:
CN1c2ccc(Cl)cc2C(=NCC1=O)c1ccccc1
: