Target
Fatty acid-binding protein, liver
Ligand
BDBM50243721
Substrate
Meas. Tech.
ChEMBL_555398 (CHEMBL964795)
Ki
12000±n/a nM
Citation
 Chuang, SVelkov, THorne, JPorter, CJScanlon, MJ Characterization of the drug binding specificity of rat liver fatty acid binding protein. J Med Chem 51:3755-64 (2008)  
Target
Name:
Fatty acid-binding protein, liver
Synonyms:
FABPL_RAT Fatty acid-binding protein, liver | Liver fatty acid binding protein (rat L-FABP)
Type:
Protein
Mol. Mass.:
14274.39
Organism:
Rattus norvegicus (Rat)
Description:
rat L-FABP
Residue:
127
  
Inhibitor
Name:
BDBM50243721
Synonyms:
1-anilinonaphthalene-8-sulfonic acid | CHEMBL471741
Type:
Small organic molecule
Emp. Form.:
C16H13NO4S
Mol. Mass.:
315.344
SMILES:
OS(=O)(=O)Oc1cccc2cccc(Nc3ccccc3)c12
: