Target
Lysosomal alpha-glucosidase
Ligand
BDBM50330955
Substrate
Meas. Tech.
ChEMBL_491529 (CHEMBL937799)
Ki
970±n/a nM
Citation
 Ozaki, SOe, HKitamura, S Alpha-glucosidase inhibitor from Kothala-himbutu (Salacia reticulata WIGHT). J Nat Prod 71:981-4 (2008)  
Target
Name:
Lysosomal alpha-glucosidase
Synonyms:
Acidic alpha-glucosidase LYAG_RAT
Type:
PROTEIN
Mol. Mass.:
106191.24
Organism:
Rattus norvegicus
Description:
ChEMBL_1506157
Residue:
953
  
Inhibitor
Name:
BDBM50330955
Synonyms:
(1S,2S)-3-[(2R,3S,4S)-3,4-dihydroxy-2-(hydroxymethyl)tetrahydrothiophenium-1-yl]-2-hydroxy-1-(hydroxymethyl)propyl sulfate CHEMBL1208974 | salacinol
Type:
Small organic molecule
Emp. Form.:
C9H18O9S2
Mol. Mass.:
334.364
SMILES:
OC[C@H](OS([O-])(=O)=O)[C@H](O)C[S@@+]1C[C@@H](O)[C@H](O)[C@H]1CO
: