Target
Sodium-dependent dopamine transporter
Ligand
BDBM50243156
Substrate
Meas. Tech.
ChEMBL_491607 (CHEMBL945183)
IC50
4600±n/a nM
Citation
 Wu, DPontillo, JChing, BHudson, SGao, YFleck, BAGogas, KWade, WS Discovery of a potent, selective, and less flexible selective norepinephrine reuptake inhibitor (sNRI). Bioorg Med Chem Lett 18:4224-7 (2008)  
Target
Name:
Sodium-dependent dopamine transporter
Synonyms:
DA transporter DAT1 Dopamine transporter protein (DAT) SC6A3_HUMAN Sodium-dependent dopamine transporter Solute carrier family 6 member 3
Type:
Multi-pass membrane protein
Mol. Mass.:
68497.11
Organism:
Homo sapiens (Human)
Description:
Q01959
Residue:
620
  
Inhibitor
Name:
BDBM50243156
Synonyms:
CHEMBL446570 | cis-N-methyl-3-(o-tolyloxy)-2,3-dihydro-1H-inden-1-amine
Type:
Small organic molecule
Emp. Form.:
C17H19NO
Mol. Mass.:
253.3389
SMILES:
CN[C@@H]1C[C@H](Oc2ccccc2C)c2ccccc12
: