Target
Sodium-dependent dopamine transporter
Ligand
BDBM50243154
Substrate
Meas. Tech.
ChEMBL_491607 (CHEMBL945183)
IC50
7000±n/a nM
Citation
 Wu, DPontillo, JChing, BHudson, SGao, YFleck, BAGogas, KWade, WS Discovery of a potent, selective, and less flexible selective norepinephrine reuptake inhibitor (sNRI). Bioorg Med Chem Lett 18:4224-7 (2008)  
Target
Name:
Sodium-dependent dopamine transporter
Synonyms:
DA transporter DAT1 Dopamine transporter protein (DAT) SC6A3_HUMAN Sodium-dependent dopamine transporter Solute carrier family 6 member 3
Type:
Multi-pass membrane protein
Mol. Mass.:
68497.11
Organism:
Homo sapiens (Human)
Description:
Q01959
Residue:
620
  
Inhibitor
Name:
BDBM50243154
Synonyms:
CHEMBL487690 | cis-3-(4-chlorophenoxy)-N,N-dimethyl-2,3-dihydro-1H-inden-1-amine
Type:
Small organic molecule
Emp. Form.:
C17H18ClNO
Mol. Mass.:
287.784
SMILES:
CN(C)[C@@H]1C[C@H](Oc2ccc(Cl)cc2)c2ccccc12
: