Target
Sodium-dependent noradrenaline transporter
Ligand
BDBM50243205
Substrate
Meas. Tech.
ChEMBL_491609 (CHEMBL945185)
IC50
3000±n/a nM
Citation
 Wu, DPontillo, JChing, BHudson, SGao, YFleck, BAGogas, KWade, WS Discovery of a potent, selective, and less flexible selective norepinephrine reuptake inhibitor (sNRI). Bioorg Med Chem Lett 18:4224-7 (2008)  
Target
Name:
Sodium-dependent noradrenaline transporter
Synonyms:
Monoamine transporter NET Noradrenaline Transporter (NET) Norepinephrine transporter protein (NET) SLC6A2 Sodium-dependent noradrenaline transporter (NET) | Solute carrier family 6 member 2
Type:
Multi-pass membrane protein
Mol. Mass.:
69337.72
Organism:
Homo sapiens (Human)
Description:
P23975
Residue:
617
  
Inhibitor
Name:
BDBM50243205
Synonyms:
CHEMBL486235 | cis-N-ethyl-3-(o-tolyloxy)-2,3-dihydro-1H-inden-1-amine
Type:
Small organic molecule
Emp. Form.:
C18H21NO
Mol. Mass.:
267.3654
SMILES:
CCN[C@@H]1C[C@H](Oc2ccccc2C)c2ccccc12
: