Target
Small conductance calcium-activated potassium channel protein 3
Ligand
BDBM50263327
Substrate
Meas. Tech.
ChEMBL_535544 (CHEMBL986170)
IC50
59±n/a nM
Citation
 Gentles, RGGrant-Young, KHu, SHuang, YPoss, MAAndres, CFiedler, TKnox, RLodge, NWeaver, CDHarden, DG Initial SAR studies on apamin-displacing 2-aminothiazole blockers of calcium-activated small conductance potassium channels. Bioorg Med Chem Lett 18:5316-9 (2008)  
Target
Name:
Small conductance calcium-activated potassium channel protein 3
Synonyms:
K3 KCNN3_HUMAN Small conductance calcium-activated potassium channel protein 3 (KCa2.3)
Type:
Protein
Mol. Mass.:
82053.75
Organism:
Homo sapiens (Human)
Description:
Q9UGI6
Residue:
731
  
Inhibitor
Name:
BDBM50263327
Synonyms:
CHEMBL476339 | N-(4-methylpyridin-2-yl)-4-(pyridin-2-yl)thiazol-2-amine
Type:
Small organic molecule
Emp. Form.:
C14H12N4S
Mol. Mass.:
268.337
SMILES:
Cc1ccnc(Nc2nc(cs2)-c2ccccn2)c1
: