Target
5-hydroxytryptamine receptor 1A
Ligand
BDBM50191636
Substrate
Meas. Tech.
ChEMBL_536734 (CHEMBL984528)
IC50
>2000±n/a nM
Citation
 Hatzenbuhler, NTBaudy, REvrard, DAFailli, AHarrison, BLLenicek, SMewshaw, RESaab, AShah, USze, JZhang, MZhou, DChlenov, MKagan, MGolembieski, JHornby, GLai, MSmith, DLSullivan, KMSchechter, LEAndree, TH Advances toward new antidepressants with dual serotonin transporter and 5-HT1A receptor affinity within a class of 3-aminochroman derivatives. Part 2. J Med Chem 51:6980-7004 (2008)  
Target
Name:
5-hydroxytryptamine receptor 1A
Synonyms:
5-HT-1A 5-hydroxytryptamine receptor 1A (5-HT-1A) ADRB2RL1 Dopamine D2 receptor and serotonin 1a receptor HTR1A | Serotonin receptor 1A
Type:
Mol. Mass.:
46122.49
Organism:
Homo sapiens (Human)
Description:
Residue:
422
  
Inhibitor
Name:
BDBM50191636
Synonyms:
CHEMBL386288 rac-N-cyclobutyl-N-[3-(5-fluoro-1H-indol-3-yl)propyl]-5-methoxychroman-3-amine
Type:
Small organic molecule
Emp. Form.:
C25H29FN2O2
Mol. Mass.:
408.5084
SMILES:
COc1cccc2OCC(Cc12)N(CCCc1c[nH]c2ccc(F)cc12)C1CCC1
: