Target
5-hydroxytryptamine receptor 1A
Ligand
BDBM50274782
Substrate
Meas. Tech.
ChEMBL_536733 (CHEMBL984527)
Ki
0.81±n/a nM
Citation
 Hatzenbuhler, NTBaudy, REvrard, DAFailli, AHarrison, BLLenicek, SMewshaw, RESaab, AShah, USze, JZhang, MZhou, DChlenov, MKagan, MGolembieski, JHornby, GLai, MSmith, DLSullivan, KMSchechter, LEAndree, TH Advances toward new antidepressants with dual serotonin transporter and 5-HT1A receptor affinity within a class of 3-aminochroman derivatives. Part 2. J Med Chem 51:6980-7004 (2008)  
Target
Name:
5-hydroxytryptamine receptor 1A
Synonyms:
5-HT-1A 5-hydroxytryptamine receptor 1A (5-HT-1A) ADRB2RL1 Dopamine D2 receptor and serotonin 1a receptor HTR1A | Serotonin receptor 1A
Type:
Mol. Mass.:
46122.49
Organism:
Homo sapiens (Human)
Description:
Residue:
422
  
Inhibitor
Name:
BDBM50274782
Synonyms:
8-Fluoro-3-{[3-(5-fluoro-1H-indol-3-yl)propyl](propyl)amino}-N-methylchromane-5-carboxamide | CHEMBL457750
Type:
Small organic molecule
Emp. Form.:
C25H29F2N3O2
Mol. Mass.:
441.5135
SMILES:
CCCN(CCCc1c[nH]c2ccc(F)cc12)C1COc2c(F)ccc(C(=O)NC)c2C1
: