Target
5-hydroxytryptamine receptor 1A
Ligand
BDBM50274414
Substrate
Meas. Tech.
ChEMBL_536733 (CHEMBL984527)
Ki
1.88±n/a nM
Citation
 Hatzenbuhler, NTBaudy, REvrard, DAFailli, AHarrison, BLLenicek, SMewshaw, RESaab, AShah, USze, JZhang, MZhou, DChlenov, MKagan, MGolembieski, JHornby, GLai, MSmith, DLSullivan, KMSchechter, LEAndree, TH Advances toward new antidepressants with dual serotonin transporter and 5-HT1A receptor affinity within a class of 3-aminochroman derivatives. Part 2. J Med Chem 51:6980-7004 (2008)  
Target
Name:
5-hydroxytryptamine receptor 1A
Synonyms:
5-HT-1A 5-hydroxytryptamine receptor 1A (5-HT-1A) ADRB2RL1 Dopamine D2 receptor and serotonin 1a receptor HTR1A | Serotonin receptor 1A
Type:
Mol. Mass.:
46122.49
Organism:
Homo sapiens (Human)
Description:
Residue:
422
  
Inhibitor
Name:
BDBM50274414
Synonyms:
(+)-3-{(Cyclopropylmethyl)[3-(5-fluoro-1H-indol-3-yl)-1-methylpropyl]amino}-8-fluorochromane-5-carboxamide CHEMBL483370
Type:
Small organic molecule
Emp. Form.:
C26H29F2N3O2
Mol. Mass.:
453.5242
SMILES:
CC(CCc1c[nH]c2ccc(F)cc12)N(CC1CC1)C1COc2c(F)ccc(C(N)=O)c2C1
: