Target
Mu-type opioid receptor
Ligand
BDBM50245894
Substrate
Meas. Tech.
ChEMBL_559163 (CHEMBL1012108)
IC50
0.288±n/a nM
Citation
 Nemoto, TFujii, HNarita, MMiyoshi, KNakamura, ASuzuki, TNagase, H Synthesis of a novel 6,14-epoxymorphinan derivative and its pharmacology. Bioorg Med Chem Lett 18:6398-401 (2008)  
Target
Name:
Mu-type opioid receptor
Synonyms:
M-OR-1 Mor OPRM_MOUSE Oprm | Oprm1
Type:
Enzyme Catalytic Domain
Mol. Mass.:
44431.62
Organism:
MOUSE
Description:
OPIATE Mu OPRM1 MOUSE::P42866
Residue:
398
  
Inhibitor
Name:
BDBM50245894
Synonyms:
CHEMBL461313 | N-{[(1R,9S,10S,13R)-17-(cyclopropylmethyl)-4-hydroxy-18-oxa-17-azapentacyclo[7.5.3.1^{10,13}.0^{1,10}.0^{2,7}]octadeca-2(7),3,5-trien-13-yl]methyl}benzamide
Type:
Small organic molecule
Emp. Form.:
C28H32N2O3
Mol. Mass.:
444.5653
SMILES:
Oc1ccc2C[C@@H]3N(CC4CC4)CC[C@@]4(C[C@@]5(CNC(=O)c6ccccc6)CC[C@@]34O5)c2c1
: