Target
Sodium-dependent serotonin transporter
Ligand
BDBM50254791
Substrate
Meas. Tech.
ChEMBL_560768 (CHEMBL1011735)
Ki
26±n/a nM
Citation
 Cashman, JRVoelker, TJohnson, RJanowsky, A Stereoselective inhibition of serotonin re-uptake and phosphodiesterase by dual inhibitors as potential agents for depression. Bioorg Med Chem 17:337-43 (2008)  
Target
Name:
Sodium-dependent serotonin transporter
Synonyms:
5-HT Transporter 5HTT SC6A4_HUMAN SLC6A4 Serotonin transporter (5HTT) Sodium-dependent serotonin transporter (SERT) | Solute carrier family 6 member 4
Type:
Multi-pass membrane protein
Mol. Mass.:
70322.51
Organism:
Homo sapiens (Human)
Description:
P31645
Residue:
630
  
Inhibitor
Name:
BDBM50254791
Synonyms:
(R)-Norfluoxetine | CHEMBL446084
Type:
Small organic molecule
Emp. Form.:
C16H16F3NO
Mol. Mass.:
295.2995
SMILES:
NCC[C@@H](Oc1ccc(cc1)C(F)(F)F)c1ccccc1
: