Target
Mu-type opioid receptor
Ligand
BDBM50128411
Substrate
Meas. Tech.
ChEMBL_558757 (CHEMBL1019886)
Ki
0.710000±n/a nM
Citation
 Wentland, MPLou, RLu, QBu, YVanAlstine, MACohen, DJBidlack, JM Syntheses and opioid receptor binding properties of carboxamido-substituted opioids. Bioorg Med Chem Lett 19:203-8 (2008)  
Target
Name:
Mu-type opioid receptor
Synonyms:
M-OR-1 MOR-1 MUOR1 Mu opiate receptor OPRM1 hMOP | mu-type opioid receptor isoform MOR-1
Type:
G Protein-Coupled Receptor (GPCR)
Mol. Mass.:
44789.51
Organism:
Homo sapiens (Human)
Description:
P35372
Residue:
400
  
Inhibitor
Name:
BDBM50128411
Synonyms:
3-desoxy-3-carboxamidonaltrexone CHEMBL56695
Type:
Small organic molecule
Emp. Form.:
C21H24N2O4
Mol. Mass.:
368.4263
SMILES:
NC(=O)c1ccc2C[C@H]3N(CC4CC4)CC[C@@]45[C@@H](Oc1c24)C(=O)CC[C@@]35O
: