Target
Kappa-type opioid receptor
Ligand
BDBM50254568
Substrate
Meas. Tech.
ChEMBL_558754 (CHEMBL1019883)
Ki
0.089000±n/a nM
Citation
 Wentland, MPLou, RLu, QBu, YVanAlstine, MACohen, DJBidlack, JM Syntheses and opioid receptor binding properties of carboxamido-substituted opioids. Bioorg Med Chem Lett 19:203-8 (2008)  
Target
Name:
Kappa-type opioid receptor
Synonyms:
Kappa Opioid Receptor OPRK1 Opiate Kappa 1 | mu/kappa opioid receptor
Type:
G Protein-Coupled Receptor (GPCR)
Mol. Mass.:
42744.99
Organism:
Cavia porcellus (domestic guinea pig)
Description:
P41144
Residue:
380
  
Inhibitor
Name:
BDBM50254568
Synonyms:
(2S,6S,11S)-6,11-Dimethyl-3-[(S)-1-(tetrahydro-furan-2-yl)methyl]-1,2,3,4,5,6-hexahydro-2,6-methano-benzo[d]azocine-8-carboxylic acid amide | CHEMBL517166
Type:
Small organic molecule
Emp. Form.:
C20H28N2O2
Mol. Mass.:
328.4485
SMILES:
C[C@@H]1[C@@H]2Cc3ccc(cc3[C@@]1(C)CCN2C[C@@H]1CCCO1)C(N)=O
: