Target
Sodium-dependent serotonin transporter
Ligand
BDBM50136674
Substrate
Meas. Tech.
ChEMBL_559244 (CHEMBL1014663)
Ki
8.8±n/a nM
Citation
 Manning, JRSexton, TChilders, SRDavies, HM 1-Naphthyl and 4-indolyl arylalkylamines as selective monoamine reuptake inhibitors. Bioorg Med Chem Lett 19:58-61 (2008)  
Target
Name:
Sodium-dependent serotonin transporter
Synonyms:
5-HT Transporter 5HT transporter Anandamid membrane transporter, AMT Monoamine transporters; Norepinephrine & serotonin Slc6a4 Sodium-dependent serotonin transporter (SERT) | imipramine receptor
Type:
Multi-pass membrane protein
Mol. Mass.:
70168.43
Organism:
Rattus norvegicus (rat)
Description:
P31652
Residue:
630
  
Inhibitor
Name:
BDBM50136674
Synonyms:
(3R)-N-methyl-3-(1-naphthyloxy)-3-(2-thienyl)propan-1-amine (R)-duloxetine LY248685
Type:
Small organic molecule
Emp. Form.:
C18H19NOS
Mol. Mass.:
297.415
SMILES:
CNCC[C@@H](Oc1cccc2ccccc12)c1cccs1
: