Target
Glyceraldehyde-3-phosphate dehydrogenase, glycosomal
Ligand
BDBM50174558
Substrate
Meas. Tech.
ChEMBL_543345 (CHEMBL1023015)
IC50
616580±n/a nM
Citation
 Freitas, RFProkopczyk, IMZottis, AOliva, GAndricopulo, ADTrevisan, MTVilegas, WSilva, MGMontanari, CA Discovery of novel Trypanosoma cruzi glyceraldehyde-3-phosphate dehydrogenase inhibitors. Bioorg Med Chem 17:2476-82 (2009)  
Target
Name:
Glyceraldehyde-3-phosphate dehydrogenase, glycosomal
Synonyms:
G3PG_TRYCR
Type:
PROTEIN
Mol. Mass.:
39070.68
Organism:
Trypanosoma cruzi
Description:
ChEMBL_973242
Residue:
359
  
Inhibitor
Name:
BDBM50174558
Synonyms:
7-hydroxy-2H-1-benzopyran-2-one CHEMBL51628 beta-umbelliferone skimmetin | umbelliferone
Type:
Small organic molecule
Emp. Form.:
C9H6O3
Mol. Mass.:
162.1421
SMILES:
Oc1ccc2ccc(=O)oc2c1
: