Target
Growth hormone secretagogue receptor type 1
Ligand
BDBM50267265
Substrate
Meas. Tech.
ChEMBL_563165 (CHEMBL964269)
IC50
9600±n/a nM
Citation
 Rosita, DDewit, MALuyt, LG Fluorine and rhenium substituted ghrelin analogues as potential imaging probes for the growth hormone secretagogue receptor. J Med Chem 52:2196-203 (2009)  
Target
Name:
Growth hormone secretagogue receptor type 1
Synonyms:
GH-releasing peptide receptor GHS-R GHSR_HUMAN Ghrelin receptor | Ghrelin receptor 1a (GHS-R1a)
Type:
Receptor
Mol. Mass.:
41334.57
Organism:
Homo sapiens (Human)
Description:
Receptor binding studies use plasma membranes from LLC PK-1 cells transiently transfected with hGHSR1a.
Residue:
366
  
Inhibitor
Name:
BDBM50267265
Synonyms:
(4S)-4-{[(2S)-1-[(2S)-2-[(2S)-2-[(2S)-2-[(2S)-2-[(2S)-2-(2-aminoacetamido)-3-hydroxypropanamido]-3-(heptanoyloxy)propanamido]-3-phenylpropanamido]-4-methylpentanamido]-3-hydroxypropanoyl]pyrrolidin-2-yl]formamido}-4-{[(1S)-1-{[(1S)-1-{[(1S)-4-carbamimidamido-1-{[(1S)-1-{[(1S)-3-carbamoyl-1-{[(1S)-3-carbamoyl-1-carboxypropyl]carbamoyl}propyl]carbamoyl}-2-methylpropyl]carbamoyl}butyl]carbamoyl}-3-carbamoylpropyl]carbamoyl}-2-(1H-imidazol-5-yl)ethyl]carbamoyl}butanoic acid | CHEMBL498956
Type:
Small organic molecule
Emp. Form.:
C75H118N22O24
Mol. Mass.:
1711.8724
SMILES:
CCCCCCC(=O)OC[C@H](NC(=O)[C@H](CO)NC(=O)CN)C(=O)N[C@@H](Cc1ccccc1)C(=O)N[C@@H](CC(C)C)C(=O)N[C@@H](CO)C(=O)N1CCC[C@H]1C(=O)N[C@@H](CCC(O)=O)C(=O)N[C@@H](Cc1cnc[nH]1)C(=O)N[C@@H](CCC(N)=O)C(=O)N[C@@H](CCCN=C(N)N)C(=O)N[C@@H](C(C)C)C(=O)N[C@@H](CCC(N)=O)C(=O)N[C@@H](CCC(N)=O)C(O)=O
: