Target
Receptor-type tyrosine-protein kinase FLT3
Ligand
BDBM50277584
Substrate
Meas. Tech.
ChEMBL_501659 (CHEMBL981407)
IC50
3±n/a nM
Citation
 Pollard, JRMortimore, M Discovery and development of aurora kinase inhibitors as anticancer agents. J Med Chem 52:2629-51 (2009)  
Target
Name:
Receptor-type tyrosine-protein kinase FLT3
Synonyms:
CD135 FL cytokine receptor FLK2 FLT3 Fetal liver kinase-2 Fms-like tyrosine kinase 3 (Flt-3) STK-1 Stem cell tyrosine kinase 1
Type:
Enzyme
Mol. Mass.:
112888.62
Organism:
Homo sapiens (Human)
Description:
P36888
Residue:
993
  
Inhibitor
Name:
BDBM50277584
Synonyms:
CHEMBL482968 | N-(5-methyl-1H-pyrazol-3-yl)-6-(4-methylpiperazin-1-yl)-2-styrylpyrimidin-4-amine
Type:
Small organic molecule
Emp. Form.:
C21H25N7
Mol. Mass.:
375.4701
SMILES:
CN1CCN(CC1)c1cc(Nc2cc(C)n[nH]2)nc(C=Cc2ccccc2)n1
: