Target
Adenosine receptor A2b
Ligand
BDBM50268164
Substrate
Meas. Tech.
ChEMBL_520180 (CHEMBL948832)
Ki
0.281±n/a nM
Citation
 Borrmann, THinz, SBertarelli, DCLi, WFlorin, NCScheiff, ABMüller, CE 1-alkyl-8-(piperazine-1-sulfonyl)phenylxanthines: development and characterization of adenosine A2B receptor antagonists and a new radioligand with subnanomolar affinity and subtype specificity. J Med Chem 52:3994-4006 (2009)  
Target
Name:
Adenosine receptor A2b
Synonyms:
AA2BR_HUMAN ADORA2B Adenosine receptors A2b | Adenosine receptors; A2a & A2b
Type:
G Protein-Coupled Receptor (GPCR)
Mol. Mass.:
36341.22
Organism:
Homo sapiens (Human)
Description:
Residue:
332
  
Inhibitor
Name:
BDBM50268164
Synonyms:
1-Ethyl-8-(4-(4-(3-trifluoromethylbenzyl)piperazine-1-sulfonyl)phenyl)-3,7-dihydropurine-2,6-dione | CHEMBL519390
Type:
Small organic molecule
Emp. Form.:
C25H25F3N6O4S
Mol. Mass.:
562.564
SMILES:
CCn1c(=O)[nH]c2nc([nH]c2c1=O)-c1ccc(cc1)S(=O)(=O)N1CCN(Cc2cccc(c2)C(F)(F)F)CC1
: