Target
Adenosine receptor A2a
Ligand
BDBM50268130
Substrate
Meas. Tech.
ChEMBL_520178 (CHEMBL948830)
Ki
263±n/a nM
Citation
 Borrmann, THinz, SBertarelli, DCLi, WFlorin, NCScheiff, ABMüller, CE 1-alkyl-8-(piperazine-1-sulfonyl)phenylxanthines: development and characterization of adenosine A2B receptor antagonists and a new radioligand with subnanomolar affinity and subtype specificity. J Med Chem 52:3994-4006 (2009)  
Target
Name:
Adenosine receptor A2a
Synonyms:
AA2AR_RAT Adenosine A2 receptor Adenosine Receptors A2a (A2a) Adenosine receptors A2a Rat striatal adenosine A2a receptor
Type:
G Protein-Coupled Receptor (GPCR)
Mol. Mass.:
45015.65
Organism:
Rattus norvegicus (rat)
Description:
Rat A2A receptors expressed in CHO cells.
Residue:
410
  
Inhibitor
Name:
BDBM50268130
Synonyms:
8-(4-(4-(3-Chlorobenzyl)piperazine-1-sulfonyl)phenyl)-1-ethyl-3,7-dihydropurine-2,6-dione | CHEMBL482638
Type:
Small organic molecule
Emp. Form.:
C24H25ClN6O4S
Mol. Mass.:
529.011
SMILES:
CCn1c(=O)[nH]c2nc([nH]c2c1=O)-c1ccc(cc1)S(=O)(=O)N1CCN(Cc2cccc(Cl)c2)CC1
: