Target
P2Y purinoceptor 6
Ligand
BDBM50118239
Substrate
Meas. Tech.
ChEMBL_521733 (CHEMBL1005023)
EC50
200±n/a nM
Citation
 Eliahu, SECamden, JLecka, JWeisman, GASévigny, JGélinas, SFischer, B Identification of hydrolytically stable and selective P2Y(1) receptor agonists. Eur J Med Chem 44:1525-36 (2009)  
Target
Name:
P2Y purinoceptor 6
Synonyms:
P2RY6_RAT Pyrimidinergic receptor P2Y6
Type:
PROTEIN
Mol. Mass.:
36704.21
Organism:
Rattus norvegicus
Description:
ChEMBL_805344
Residue:
328
  
Inhibitor
Name:
BDBM50118239
Synonyms:
CHEMBL130266 Uridine diphosphate | uridine 5'-(trihydrogen diphosphate)
Type:
Small organic molecule
Emp. Form.:
C9H14N2O12P2
Mol. Mass.:
404.1612
SMILES:
O[C@@H]1[C@@H](COP(O)(=O)OP(O)(O)=O)O[C@H]([C@@H]1O)n1ccc(=O)[nH]c1=O
: