Target
Mu-type opioid receptor
Ligand
BDBM50277470
Substrate
Meas. Tech.
ChEMBL_502280 (CHEMBL983951)
Ki
0.397±n/a nM
Citation
 Watanabe, AFujii, HNakajima, MHasebe, KMochizuki, HNagase, H Synthesis of a new opioid ligand having the oxabicyclo[3.2.1]octane skeleton using a new rearrangement reaction. Bioorg Med Chem Lett 19:2416-9 (2009)  
Target
Name:
Mu-type opioid receptor
Synonyms:
M-OR-1 Mu opioid receptor OPIATE Mu OPRM_CAVPO
Type:
Enzyme Catalytic Domain
Mol. Mass.:
11165.58
Organism:
GUINEA PIG
Description:
P97266
Residue:
98
  
Inhibitor
Name:
BDBM50277470
Synonyms:
(1R,9R,10S,13R)-18-(cyclopropylmethyl)-4-hydroxy-19-oxa-18-azapentacyclo[7.6.3.1^{10,13}.0^{1,10}.0^{2,7}]nonadeca-2(7),3,5-trien-14-one | CHEMBL474296
Type:
Small organic molecule
Emp. Form.:
C21H25NO3
Mol. Mass.:
339.4281
SMILES:
Oc1ccc2C[C@H]3N(CC4CC4)CC[C@@]4(CC(=O)[C@H]5CC[C@@]34O5)c2c1
: