Target
Cathepsin D
Ligand
BDBM50302841
Substrate
Meas. Tech.
ChEMBL_595447 (CHEMBL1045212)
IC50
25±n/a nM
Citation
 Sealy, JMTruong, APTso, LProbst, GDAquino, JHom, RKJagodzinska, BMDressen, DWone, DWBrogley, LJohn, VTung, JSPleiss, MATucker, JAKonradi, AWDappen, MSToth, GPan, HRuslim, LMiller, JBova, MPSinha, SQuinn, KPSauer, JM Design and synthesis of cell potent BACE-1 inhibitors: structure-activity relationship of P1' substituents. Bioorg Med Chem Lett 19:6386-91 (2009)  
Target
Name:
Cathepsin D
Synonyms:
CATD_HUMAN CTSD Cathepsin D heavy chain Cathepsin D precursor
Type:
Enzyme
Mol. Mass.:
44551.72
Organism:
Homo sapiens (Human)
Description:
Human proCathepsin D (SwissProt accession number P07339) was expressed in Sf9 cells, purified, and autoactivated.
Residue:
412
  
Inhibitor
Name:
BDBM50302841
Synonyms:
CHEMBL571860 N-[(1S,2R)-3-{[1-(3-tert-butylphenyl)cyclohexyl]amino}-1-(3,5-difluorobenzyl)-2-hydroxypropyl]acetamide
Type:
Small organic molecule
Emp. Form.:
C28H38F2N2O2
Mol. Mass.:
472.6103
SMILES:
CC(=O)N[C@@H](Cc1cc(F)cc(F)c1)[C@H](O)CNC1(CCCCC1)c1cccc(c1)C(C)(C)C
: