Target
Ribosomal protein S6 kinase alpha-6
Ligand
BDBM5445
Substrate
Meas. Tech.
ChEMBL_586359 (CHEMBL1039275)
Kd
>10000±n/a nM
Citation
 Karaman, MWHerrgard, STreiber, DKGallant, PAtteridge, CECampbell, BTChan, KWCiceri, PDavis, MIEdeen, PTFaraoni, RFloyd, MHunt, JPLockhart, DJMilanov, ZVMorrison, MJPallares, GPatel, HKPritchard, SWodicka, LMZarrinkar, PP A quantitative analysis of kinase inhibitor selectivity. Nat Biotechnol 26:127-32 (2008)  
Target
Name:
Ribosomal protein S6 kinase alpha-6
Synonyms:
90 kDa ribosomal protein S6 kinase 6 RPS6KA6 RPS6KA6(Kin.Dom.2 - C-terminal) RSK4 Ribosomal S6 kinase 4 Ribosomal protein S6 kinase alpha 6 (RSK4) S6K-alpha 6 p90RSK | pp90RSK4
Type:
Serine/threonine-protein kinase
Mol. Mass.:
83868.06
Organism:
Homo sapiens (Human)
Description:
Residue:
745
  
Inhibitor
Name:
BDBM5445
Synonyms:
CHEMBL554 LAPATINIB DITOSYLATE N-{3-chloro-4-[(3-fluoro-benzyl)oxy]phenyl}-6-[5-({2-(methylsulfonyl)ethyl]amino}methyl)-2-furyl]-4-quinazolinamine Tykerb US10822334, Compound Lapatinib cid_208908
Type:
Small organic molecule
Emp. Form.:
C29H26ClFN4O4S
Mol. Mass.:
581.058
SMILES:
CS(=O)(=O)CCNCc1ccc(o1)-c1ccc2ncnc(Nc3ccc(OCc4cccc(F)c4)c(Cl)c3)c2c1
: