Target
Protein-tyrosine kinase 6
Ligand
BDBM13531
Substrate
Meas. Tech.
ChEMBL_587215 (CHEMBL1061159)
Kd
6800±n/a nM
Citation
 Karaman, MWHerrgard, STreiber, DKGallant, PAtteridge, CECampbell, BTChan, KWCiceri, PDavis, MIEdeen, PTFaraoni, RFloyd, MHunt, JPLockhart, DJMilanov, ZVMorrison, MJPallares, GPatel, HKPritchard, SWodicka, LMZarrinkar, PP A quantitative analysis of kinase inhibitor selectivity. Nat Biotechnol 26:127-32 (2008)  
Target
Name:
Protein-tyrosine kinase 6
Synonyms:
BRK KH domain-containing, RNA-binding, signal transduction-associated protein 1 PTK6_HUMAN Tyrosine Kinase BRK Tyrosine-protein kinase BRK
Type:
Tyrosine-protein kinase
Mol. Mass.:
51839.11
Organism:
Homo sapiens (Human)
Description:
Residue:
451
  
Inhibitor
Name:
BDBM13531
Synonyms:
4-(4-Fluorophenyl)-2-(4-hydroxyphenyl)-5-(4-pyridyl)-1H-imidazole 4-[4-(4-fluorophenyl)-5-(4-pyridyl)-4-imidazolin-2-ylidene]cyclohexa-2,5-dien-1-one SB-202190 biotinylated SB202190
Type:
Small organic molecule
Emp. Form.:
C20H14FN3O
Mol. Mass.:
331.3431
SMILES:
Oc1ccc(cc1)-c1nc(c([nH]1)-c1ccc(F)cc1)-c1ccncc1
: