Target
Serine/threonine-protein kinase D3
Ligand
BDBM26300
Substrate
Meas. Tech.
ChEMBL_586720 (CHEMBL1062866)
Kd
>10000±n/a nM
Citation
 Karaman, MWHerrgard, STreiber, DKGallant, PAtteridge, CECampbell, BTChan, KWCiceri, PDavis, MIEdeen, PTFaraoni, RFloyd, MHunt, JPLockhart, DJMilanov, ZVMorrison, MJPallares, GPatel, HKPritchard, SWodicka, LMZarrinkar, PP A quantitative analysis of kinase inhibitor selectivity. Nat Biotechnol 26:127-32 (2008)  
Target
Name:
Serine/threonine-protein kinase D3
Synonyms:
EPK2 PRKCN Protein kinase C nu Protein kinase C, PKC Protein kinase EPK2 classical/novel | nPKC-nu
Type:
Enzyme Catalytic Domain
Mol. Mass.:
100475.64
Organism:
Homo sapiens (Human)
Description:
gi_5031689
Residue:
890
  
Inhibitor
Name:
BDBM26300
Synonyms:
2-{3-[(7-{3-[ethyl(2-hydroxyethyl)amino]propoxy}quinazolin-4-yl)amino]-1H-pyrazol-5-yl}-N-(3-fluorophenyl)acetamide cid_16007391 | pyrazoloquinazoline deriv., 34
Type:
Small organic molecule
Emp. Form.:
C26H30FN7O3
Mol. Mass.:
507.5599
SMILES:
CCN(CCO)CCCOc1ccc2c(Nc3cc(CC(=O)Nc4cccc(F)c4)n[nH]3)ncnc2c1
: