Target
Mitogen-activated protein kinase 8
Ligand
BDBM13531
Substrate
Meas. Tech.
ChEMBL_586332 (CHEMBL1061076)
Kd
2400±n/a nM
Citation
 Karaman, MWHerrgard, STreiber, DKGallant, PAtteridge, CECampbell, BTChan, KWCiceri, PDavis, MIEdeen, PTFaraoni, RFloyd, MHunt, JPLockhart, DJMilanov, ZVMorrison, MJPallares, GPatel, HKPritchard, SWodicka, LMZarrinkar, PP A quantitative analysis of kinase inhibitor selectivity. Nat Biotechnol 26:127-32 (2008)  
Target
Name:
Mitogen-activated protein kinase 8
Synonyms:
JNK-46 JNK1-alpha-1 MK08_HUMAN PRKM8 SAPK1C c-Jun N-terminal kinase 1 c-Jun N-terminal kinase 1(JNK1) | c-Jun N-terminal kinase 2 (JNK2)
Type:
Enzyme
Mol. Mass.:
48297.57
Organism:
Homo sapiens (Human)
Description:
JNK-1 was purchased from Upstate Cell Signaling Solutions (formerly Upstate Biotechnology).
Residue:
427
  
Inhibitor
Name:
BDBM13531
Synonyms:
4-(4-Fluorophenyl)-2-(4-hydroxyphenyl)-5-(4-pyridyl)-1H-imidazole 4-[4-(4-fluorophenyl)-5-(4-pyridyl)-4-imidazolin-2-ylidene]cyclohexa-2,5-dien-1-one SB-202190 biotinylated SB202190
Type:
Small organic molecule
Emp. Form.:
C20H14FN3O
Mol. Mass.:
331.3431
SMILES:
Oc1ccc(cc1)-c1nc(c([nH]1)-c1ccc(F)cc1)-c1ccncc1
: