Target
P2Y purinoceptor 2
Ligand
BDBM50118213
Substrate
Meas. Tech.
ChEMBL_587769 (CHEMBL1040420)
EC50
1260±n/a nM
Citation
 Sauer, REl-Tayeb, AKaulich, MMüller, CE Synthesis of uracil nucleotide analogs with a modified, acyclic ribose moiety as P2Y(2) receptor antagonists. Bioorg Med Chem 17:5071-9 (2009)  
Target
Name:
P2Y purinoceptor 2
Synonyms:
ATP receptor P2U purinoceptor 1 P2Y purinoceptor 2 P2ru1 Purinergic receptor | Purinergic receptor P2Y2
Type:
PROTEIN
Mol. Mass.:
42202.78
Organism:
Mus musculus
Description:
ChEMBL_587770
Residue:
373
  
Inhibitor
Name:
BDBM50118213
Synonyms:
5'-UTP H4utp uridine 5'-(tetrahydrogen triphosphate) | uridine 5'-triphosphoric acid
Type:
Small organic molecule
Emp. Form.:
C9H15N2O15P3
Mol. Mass.:
484.1411
SMILES:
O[C@@H]1[C@@H](COP(O)(=O)OP(O)(=O)OP(O)(O)=O)O[C@H]([C@@H]1O)n1ccc(=O)[nH]c1=O
: