Target
5-hydroxytryptamine receptor 3A
Ligand
BDBM50258292
Substrate
Meas. Tech.
ChEMBL_592418 (CHEMBL1037804)
Ki
11.7±n/a nM
Citation
 Butini, SBudriesi, RHamon, MMorelli, EGemma, SBrindisi, MBorrelli, GNovellino, EFiorini, IIoan, PChiarini, ACagnotto, AMennini, TFracasso, CCaccia, SCampiani, G Novel, potent, and selective quinoxaline-based 5-HT(3) receptor ligands. 1. Further structure-activity relationships and pharmacological characterization. J Med Chem 52:6946-50 (2009)  
Target
Name:
5-hydroxytryptamine receptor 3A
Synonyms:
5-HT3 5HT3A_RAT Htr3 Serotonin (5-HT) receptor | Zacopride site-R
Type:
Enzyme Catalytic Domain
Mol. Mass.:
55428.70
Organism:
RAT
Description:
5-HT3 HTR3A RAT::P35563
Residue:
483
  
Inhibitor
Name:
BDBM50258292
Synonyms:
2-(4-(7-fluoropyrrolo[1,2-a]quinoxalin-4-yl)piperazin-1-yl)acetic acid [4-(7-Fluoropyrrolo[1,2-a]quinoxalin-4-yl)piperazin-1-yl]acetic Acid
Type:
Small organic molecule
Emp. Form.:
C17H17FN4O2
Mol. Mass.:
328.3409
SMILES:
OC(=O)CN1CCN(CC1)c1nc2cc(F)ccc2n2cccc12
: