Target
Carbonic anhydrase
Ligand
BDBM33277
Substrate
Meas. Tech.
ChEMBL_599732 (CHEMBL1048176)
Ki
8900±n/a nM
Citation
 Maresca, ACarta, FVullo, DScozzafava, ASupuran, CT Carbonic anhydrase inhibitors. Inhibition of the Rv1284 and Rv3273 beta-carbonic anhydrases from Mycobacterium tuberculosis with diazenylbenzenesulfonamides. Bioorg Med Chem Lett 19:4929-32 (2009)  
Target
Name:
Carbonic anhydrase
Synonyms:
PROBABLE TRANSMEMBRANE CARBONIC ANHYDRASE (CARBONATE DEHYDRATASE) (CARBONIC DEHYDRATASE)
Type:
PROTEIN
Mol. Mass.:
80567.22
Organism:
Mycobacterium tuberculosis
Description:
ChEMBL_878775
Residue:
764
  
Inhibitor
Name:
BDBM33277
Synonyms:
sulfonate, 3
Type:
Small organic molecule
Emp. Form.:
C7H8NO3S
Mol. Mass.:
186.209
SMILES:
[O-]S(=O)(=O)CNc1ccccc1
: