Target
Substance-K receptor
Ligand
BDBM50001447
Substrate
Meas. Tech.
ChEMBL_597393 (CHEMBL1037216)
EC50
64.8±n/a nM
Citation
 Valant, CMaillet, EBourguignon, JJBucher, BUtard, VGalzi, JLHibert, M Allosteric functional switch of neurokinin A-mediated signaling at the neurokinin NK2 receptor: structural exploration. J Med Chem 52:5999-6011 (2009)  
Target
Name:
Substance-K receptor
Synonyms:
NK-2 receptor NK2R_RAT Neurokinin A receptor SKR Tac2r Tacr2
Type:
Enzyme Catalytic Domain
Mol. Mass.:
43868.63
Organism:
Rattus norvegicus (Rat)
Description:
Neurokinin NK2 TACR2 Murine::P16610
Residue:
390
  
Inhibitor
Name:
BDBM50001447
Synonyms:
CHEMBL217406 His-Lys-Thr-Asp-Ser-Phe-Val-Gly-Leu-Met-NH2(NeurokininA)
Type:
Small organic molecule
Emp. Form.:
C50H80N14O14S
Mol. Mass.:
1133.321
SMILES:
CSCC[C@H](NC(=O)[C@H](CC(C)C)NC(=O)CNC(=O)[C@@H](NC(=O)[C@H](Cc1ccccc1)NC(=O)[C@H](CO)NC(=O)[C@H](CC(O)=O)NC(=O)[C@@H](NC(=O)[C@H](CCCCN)NC(=O)[C@@H](N)Cc1cnc[nH]1)[C@@H](C)O)C(C)C)C(N)=O
: