Target
Sodium-dependent serotonin transporter
Ligand
BDBM50304388
Substrate
Meas. Tech.
ChEMBL_602896 (CHEMBL1038439)
Ki
18±n/a nM
Citation
 Cashman, JRGhirmai, S Inhibition of serotonin and norepinephrine reuptake and inhibition of phosphodiesterase by multi-target inhibitors as potential agents for depression. Bioorg Med Chem 17:6890-7 (2009)  
Target
Name:
Sodium-dependent serotonin transporter
Synonyms:
5-HT Transporter 5HTT SC6A4_HUMAN SLC6A4 Serotonin transporter (5HTT) Sodium-dependent serotonin transporter (SERT) | Solute carrier family 6 member 4
Type:
Multi-pass membrane protein
Mol. Mass.:
70322.51
Organism:
Homo sapiens (Human)
Description:
P31645
Residue:
630
  
Inhibitor
Name:
BDBM50304388
Synonyms:
(S)-3-(Naphthalen-1-yloxy)-3-thiophen-2-yl-propylamine | CHEMBL595063
Type:
Small organic molecule
Emp. Form.:
C17H17NOS
Mol. Mass.:
283.388
SMILES:
NCC[C@H](Oc1cccc2ccccc12)c1cccs1
: