Target
D(1B) dopamine receptor
Ligand
BDBM50010686
Substrate
Meas. Tech.
ChEMBL_603141 (CHEMBL1039721)
Ki
16±n/a nM
Citation
 Schulze, MMüller, FKMason, JMGörls, HLehmann, JEnzensperger, C Dibenzazecine scaffold rebuilding--is the flexibility always essential for high dopamine receptor affinities? Bioorg Med Chem 17:6898-907 (2009)  
Target
Name:
D(1B) dopamine receptor
Synonyms:
D(1B) dopamine receptor DRD5_RAT Dopamine D5 receptor Drd5
Type:
Enzyme Catalytic Domain
Mol. Mass.:
52827.88
Organism:
RAT
Description:
Dopamine D1B 0 RAT::P25115
Residue:
475
  
Inhibitor
Name:
BDBM50010686
Synonyms:
(6aR,12bS)-10,11-Dihydroxy-5,6,6a,7,8,12b-hexahydro-benzo[a]phenanthridinium 10,11-Dihydroxy-5,6,6a,7,8,12b-hexahydro-benzo[a]phenanthridinium(DHX) CHEMBL25856 | dihydrexidine
Type:
Small organic molecule
Emp. Form.:
C17H17NO2
Mol. Mass.:
267.3224
SMILES:
Oc1cc2CC[C@H]3NCc4ccccc4[C@@H]3c2cc1O
: