Target
Asialoglycoprotein receptor 1
Ligand
BDBM50240803
Substrate
Meas. Tech.
ChEMBL_603826 (CHEMBL1042966)
Kd
>10000000±n/a nM
Citation
 Stokmaier, DKhorev, OCutting, BBorn, RRicklin, DErnst, TOBöni, FSchwingruber, KGentner, MWittwer, MSpreafico, MVedani, ARabbani, SSchwardt, OErnst, B Design, synthesis and evaluation of monovalent ligands for the asialoglycoprotein receptor (ASGP-R). Bioorg Med Chem 17:7254-64 (2009)  
Target
Name:
Asialoglycoprotein receptor 1
Synonyms:
ASGP-R 1 ASGR1 CLEC4H1 | Hepatic lectin H1
Type:
PROTEIN
Mol. Mass.:
33177.60
Organism:
Homo sapiens (Human)
Description:
ChEMBL_603824
Residue:
291
  
Inhibitor
Name:
BDBM50240803
Synonyms:
CHEMBL1614854 beta-D-glucopyranose | beta-D-glucose
Type:
Small organic molecule
Emp. Form.:
C6H12O6
Mol. Mass.:
180.1559
SMILES:
OC[C@H]1O[C@@H](O)[C@H](O)[C@@H](O)[C@@H]1O
: