Target
P2Y purinoceptor 2
Ligand
BDBM50205406
Substrate
Meas. Tech.
ChEMBL_611631 (CHEMBL1068968)
EC50
8±n/a nM
Citation
 Ginsburg-Shmuel, THaas, MSchumann, MReiser, GKalid, OStern, NFischer, B 5-OMe-UDP is a potent and selective P2Y(6)-receptor agonist. J Med Chem 53:1673-85 (2010)  
Target
Name:
P2Y purinoceptor 2
Synonyms:
ATP receptor P2RY2 P2U purinoceptor 1 P2Y purinoceptor 2 Purinergic receptor | Purinergic receptor P2Y2
Type:
PROTEIN
Mol. Mass.:
42299.21
Organism:
Homo sapiens (Human)
Description:
ChEMBL_1455361
Residue:
377
  
Inhibitor
Name:
BDBM50205406
Synonyms:
((2R,3S,4R,5R)-4-amino-3-hydroxy-5-(4-oxo-2-thioxo-3,4-dihydropyrimidin-1(2H)-yl)tetrahydrofuran-2-yl)methyl tetrahydrogen triphosphate CHEMBL373780
Type:
Small organic molecule
Emp. Form.:
C9H16N3O13P3S
Mol. Mass.:
499.222
SMILES:
N[C@@H]1[C@H](O)[C@@H](COP(O)(=O)OP(O)(=O)OP(O)(O)=O)O[C@H]1n1ccc(=O)[nH]c1=S
: