Target
Vasopressin V1a receptor
Ligand
BDBM50307115
Substrate
Meas. Tech.
ChEMBL_609618 (CHEMBL1065233)
Ki
167±n/a nM
Citation
 Frantz, MCRodrigo, JBoudier, LDurroux, TMouillac, BHibert, M Subtlety of the structure-affinity and structure-efficacy relationships around a nonpeptide oxytocin receptor agonist. J Med Chem 53:1546-62 (2010)  
Target
Name:
Vasopressin V1a receptor
Synonyms:
AVPR V1a AVPR1A V1AR_HUMAN VASOPRESSIN V1A Vasopressin V1 receptor Vasopressin receptor
Type:
Receptor
Mol. Mass.:
46820.18
Organism:
Homo sapiens (Human)
Description:
P37288
Residue:
418
  
Inhibitor
Name:
BDBM50307115
Synonyms:
CHEMBL602871 | N-{2-Methyl-4-[(1-methyl-4,10-dihydropyrazolo[3,4-b][1,5]benzodiazepin-5(1H)-yl)carbonyl]benzyl}pyrrolidine-1-carboxamide
Type:
Small organic molecule
Emp. Form.:
C25H28N6O2
Mol. Mass.:
444.5288
SMILES:
Cc1cc(ccc1CNC(=O)N1CCCC1)C(=O)N1Cc2cnn(C)c2Nc2ccccc12
: