Target
Vasopressin V1a receptor
Ligand
BDBM50307113
Substrate
Meas. Tech.
ChEMBL_609618 (CHEMBL1065233)
Ki
>5000±n/a nM
Citation
 Frantz, MCRodrigo, JBoudier, LDurroux, TMouillac, BHibert, M Subtlety of the structure-affinity and structure-efficacy relationships around a nonpeptide oxytocin receptor agonist. J Med Chem 53:1546-62 (2010)  
Target
Name:
Vasopressin V1a receptor
Synonyms:
AVPR V1a AVPR1A V1AR_HUMAN VASOPRESSIN V1A Vasopressin V1 receptor Vasopressin receptor
Type:
Receptor
Mol. Mass.:
46820.18
Organism:
Homo sapiens (Human)
Description:
P37288
Residue:
418
  
Inhibitor
Name:
BDBM50307113
Synonyms:
CHEMBL603076 | N-{2-Methyl-4-[(1-methyl-4,10-dihydropyrazolo[3,4-b][1,5]benzodiazepin-5(1H)-yl)carbonyl]benzyl}acetamide
Type:
Small organic molecule
Emp. Form.:
C22H23N5O2
Mol. Mass.:
389.4503
SMILES:
CC(=O)NCc1ccc(cc1C)C(=O)N1Cc2cnn(C)c2Nc2ccccc12
: