Target
Fibroblast growth factor 1
Ligand
BDBM50307402
Substrate
Meas. Tech.
ChEMBL_610685 (CHEMBL1072346)
Kd
210±n/a nM
Citation
 Johnstone, KDKaroli, TLiu, LDredge, KCopeman, ELi, CPDavis, KHammond, EBytheway, IKostewicz, EChiu, FCShackleford, DMCharman, SACharman, WNHarenberg, JGonda, TJFerro, V Synthesis and biological evaluation of polysulfated oligosaccharide glycosides as inhibitors of angiogenesis and tumor growth. J Med Chem 53:1686-99 (2010)  
Target
Name:
Fibroblast growth factor 1
Synonyms:
Acidic fibroblast growth factor ECGF-beta FGF1_HUMAN Fibroblast growth factor 1 (FGF-1) Heparin-binding growth factor 1 | aFGF
Type:
Protein
Mol. Mass.:
17461.01
Organism:
Homo sapiens (Human)
Description:
P05230
Residue:
155
  
Inhibitor
Name:
BDBM50307402
Synonyms:
4-Butylbenzyl 2,3,4,6-Tetra-O-sulfo-alpha-D-mannopyranosyl-(1->3)-2,4,6-tri-O-sulfo-alpha-D-mannopyranosyl-(1->3)-2,4,6-tri-O-sulfo-alpha-D-mannopyranosyl-(1->2)-3,4,6-tri-O-sulfo-alpha-D-mannopyranoside, TridecasodiumSalt | CHEMBL590010
Type:
Small organic molecule
Emp. Form.:
C35H43O60S13
Mol. Mass.:
1840.532
SMILES:
CCCCc1ccc(CO[C@H]2O[C@H](COS([O-])(=O)=O)[C@@H](OS([O-])(=O)=O)[C@H](OS([O-])(=O)=O)[C@@H]2O[C@H]2O[C@H](COS([O-])(=O)=O)[C@@H](OS([O-])(=O)=O)[C@H](O[C@H]3O[C@H](COS([O-])(=O)=O)[C@@H](OS([O-])(=O)=O)[C@H](O[C@H]4O[C@H](COS([O-])(=O)=O)[C@@H](OS([O-])(=O)=O)[C@H](OS([O-])(=O)=O)[C@@H]4OS([O-])(=O)=O)[C@@H]3OS([O-])(=O)=O)[C@@H]2OS([O-])(=O)=O)cc1
: