Target
Ectonucleoside triphosphate diphosphohydrolase 2
Ligand
BDBM50268574
Substrate
Meas. Tech.
ChEMBL_612639 (CHEMBL1065676)
Ki
>400000±n/a nM
Citation
 Baqi, YLee, SYIqbal, JRipphausen, PLehr, AScheiff, ABZimmermann, HBajorath, JMüller, CE Development of potent and selective inhibitors of ecto-5'-nucleotidase based on an anthraquinone scaffold. J Med Chem 53:2076-86 (2010)  
Target
Name:
Ectonucleoside triphosphate diphosphohydrolase 2
Synonyms:
Cd39l1 Entpd2
Type:
PROTEIN
Mol. Mass.:
54401.50
Organism:
Rattus norvegicus
Description:
ChEMBL_612639
Residue:
495
  
Inhibitor
Name:
BDBM50268574
Synonyms:
CHEMBL498423 Sodium 1-amino-4-[1-naphthylamino]-9,10-dioxo-9,10 dihydroanthracene-2-sulfonate
Type:
Small organic molecule
Emp. Form.:
C24H15N2O5S
Mol. Mass.:
443.452
SMILES:
Nc1c2C(=O)c3ccccc3C(=O)c2c(Nc2cccc3ccccc23)cc1S([O-])(=O)=O
: